{"text_format":"1","workbook":"xlsx","n_sheets":25,"sheets":["Form 1 Main","Form 1 Assets","Form 1 Liabilities & Fin. Adj.","Declaration","Form 2","Form 3","Form 4 Table 1","Form 4 Table 2","Form 5","Form 6","Form 7","Form 8 Table 1","Form 8 Table 2","Form 9","Form 10 Table 1","Form 10 Table 2","Form 10 Table 3","Form 10 Table 4","Form 10 Table 5","Form 10 Table 6","Form 11","Form 12","Config","Error Message","Label Mapping"],"not_rendered":{"charts":0,"images":60,"macros":1,"external_links":0,"defined_names":722,"comments":0,"pivot_tables":0},"unopened":[],"bounds":{"document_bytes":16777216,"sheet_cells":100000,"rows_first":2000,"rows_last":500,"rows_between":2000,"halvings":0,"cell_chars":16384,"cell_head_chars":4096},"cells_cut":0,"cells_raw":0,"read":"whole","date_system":"1900"}

{"sheet":"Form 1 Main","index":0,"n_rows":72,"n_cols":12,"rows_kept":72,"cut":false,"hidden":false,"merged":[[71,1,71,4],[1,1,1,9],[4,4,4,7],[2,1,2,9],[69,2,69,8],[15,6,15,8],[13,6,13,8],[17,6,17,8],[22,6,22,8],[5,1,5,10],[70,2,70,8],[9,1,9,7]]}
[null,null,null,null,null,null,null,null,null,null,{"$f":"IF(ISBLANK(Config!C7),\"\",Config!C7)","v":""}]
[null,"《證券及期貨條例》(第 571 章)"]
[null,"《證券及期貨(財政資源)規則》(第 571N 章)"]
[null,null,null,null,"    *",null,"[1000]","財務申報表 (附註 1)"]
[]
[null,"(為遵守《證券及期貨條例》(第 571 章) 第 145 條，\n即在《證券及期貨(財政資源)規則》(第 571N 章) 第 56 條所闡述的規定的目的而訂立)"]
{"$rows_left_out":67}
{"sheet":"Form 1 Assets","index":1,"n_rows":96,"n_cols":9,"rows_kept":96,"cut":false,"hidden":false,"merged":[[12,8,15,8],[16,5,20,5],[16,8,20,8],[21,4,22,4],[34,6,37,6],[16,7,20,7],[30,7,33,7],[48,7,56,7],[21,6,25,6],[21,7,25,7],[26,6,29,6],[26,7,29,7],[34,7,37,7],[38,7,42,7],[66,5,67,5],[38,6,42,6],[69,6,70,6],[0,0,0,4],[48,6,56,6],[4,2,4,3],[16,2,16,3],[61,6,62,6],[16,6,20,6],[43,6,47,6],[59,6,60,6],[12,6,15,6],[30,6,33,6],[88,5,91,5],[86,6,87,6],[77,4,78,4],[78,7,79,7],[82,6,84,6],[82,7,84,7],[94,7,97,7],[92,6,93,6],[92,7,93,7],[88,6,91,6],[88,7,91,7],[94,6,97,6],[59,7,60,7],[86,7,87,7],[71,6,76,6],[71,7,76,7],[78,6,79,6],[63,6,64,6],[66,6,67,6],[61,7,62,7],[94,8,97,8],[16,4,17,4],[12,7,15,7],[3,6,4,6],[3,7,4,7],[9,4,10,4],[4,4,5,4],[9,6,11,6],[9,7,11,7],[12,5,15,5],[82,8,84,8],[66,7,67,7],[66,8,67,8],[63,7,64,7],[69,7,70,7],[43,7,47,7]]}
[{"$f":"IF(ISBLANK('Form 1 Main'!G14),\"\",'Form 1 Main'!G14)&IF('Form 1 Main'!L20=\"\",\"\",\"截至\"&'Form 1 Main'!L20&\"止申報月份\")&IF(ISBLANK('Form 1 Main'!G14),\"\",\"的財務申報表\")","v":""},null,null,null,null,null,null,null,{"$f":"IF(ISBLANK(Config!C7),\"\",Config!C7)","v":""}]
[]
[]
[null,null,null,null,null,null,"列入速動資\n金計算表內\n的數額","列入資產\n負債表內\n的數額"]
[null,"項","資產",null,"條次\n(附註 3)"]
[null,null,null,null,null,null,"(HK$'000)","(HK$'000)"]
{"$rows_left_out":91}
{"sheet":"Form 1 Liabilities & Fin. Adj.","index":2,"n_rows":151,"n_cols":9,"rows_kept":151,"cut":false,"hidden":false,"merged":[[114,7,116,7],[110,6,113,6],[110,7,113,7],[114,6,116,6],[95,6,96,6],[95,5,96,5],[87,5,89,5],[110,5,113,5],[114,5,116,5],[90,5,92,5],[146,8,147,8],[150,8,151,8],[117,5,121,5],[122,8,124,8],[142,8,143,8],[144,8,145,8],[117,7,121,7],[150,7,151,7],[117,6,121,6],[122,7,124,7],[126,2,126,7],[146,7,147,7],[128,2,128,7],[144,6,145,6],[144,7,145,7],[142,7,143,7],[97,8,101,8],[102,5,103,5],[104,5,109,5],[102,6,103,6],[104,6,109,6],[104,7,109,7],[97,7,101,7],[102,7,103,7],[97,6,101,6],[0,0,0,4],[42,4,43,4],[14,5,19,5],[10,4,13,4],[10,5,13,5],[26,5,28,5],[29,5,35,5],[6,6,9,6],[6,7,9,7],[4,2,5,3],[6,5,9,5],[3,6,4,6],[3,7,4,7],[36,7,41,7],[10,7,13,7],[29,6,35,6],[29,7,35,7],[14,7,19,7],[10,6,13,6],[25,6,28,6],[25,7,28,7],[36,6,41,6],[78,5,80,5],[81,5,84,5],[85,5,86,5],[90,6,92,6],[14,6,19,6],[62,5,64,5],[65,5,66,5],[45,5,48,5],[26,8,28,8],[53,6,55,6],[67,5,68,5],[62,6,64,6],[59,7,96,7],[69,5,71,5],[75,5,77,5],[65,6,66,6],[85,6,86,6],[69,6,71,6],[29,8,35,8],[53,5,55,5],[53,8,55,8],[49,6,52,6],[49,7,52,7],[53,7,55,7],[45,8,48,8],[87,6,89,6],[45,7,48,7],[78,6,80,6],[81,6,84,6],[56,6,58,6],[56,7,58,7],[56,8,58,8],[45,6,48,6],[60,6,61,6],[75,6,77,6],[73,6,74,6],[67,6,68,6]]}
[{"$f":"IF(ISBLANK('Form 1 Main'!G14),\"\",'Form 1 Main'!G14)&IF('Form 1 Main'!L21=\"\",\"\",\"截至\"&'Form 1 Main'!L21&\"止申報月份\")&IF(ISBLANK('Form 1 Main'!G14),\"\",\"的財務申報表\")","v":""},null,null,null,null,null,null,null,{"$f":"IF(ISBLANK(Config!C7),\"\",Config!C7)","v":""}]
[]
[]
[null,null,null,null,null,null,"列入速動資金\n計算表內的數額","列入資產負債\n表內的數額"]
[null,"項","負債",null,"條次"]
[null,null,null,null,null,null,"(HK$'000)","(HK$'000)"]
{"$rows_left_out":146}
{"sheet":"Declaration","index":3,"n_rows":45,"n_cols":10,"rows_kept":45,"cut":false,"hidden":false,"merged":[[0,0,0,4],[4,1,4,7],[44,2,44,7],[42,2,43,7],[31,2,31,3],[5,2,5,7]]}
[{"$f":"IF(ISBLANK('Form 1 Main'!G14),\"\",'Form 1 Main'!G14)&IF('Form 1 Main'!L21=\"\",\"\",\"截至\"&'Form 1 Main'!L21&\"止申報月份\")&IF(ISBLANK('Form 1 Main'!G14),\"\",\"的財務申報表\")","v":""},null,null,null,null,null,null,null,{"$f":"IF(ISBLANK(Config!C7),\"\",Config!C7)","v":""}]
[null,"聲 明"]
[]
[]
[null,"本人證明以下記項、申報表、分析或報告所載的資料，盡我所知及所信是真確無訛的。此外，本人亦確認，凡本人留空任何記項、申報表、分析或報告，即表明並無有關資料可供申報，或有關記項、申報表、分析或報告並不適用："]
[]
{"$rows_left_out":40}
{"sheet":"Form 2","index":4,"n_rows":60,"n_cols":15,"rows_kept":60,"cut":false,"hidden":false,"merged":[[59,13,60,13],[7,13,9,13],[45,10,46,10],[50,10,51,10],[52,10,55,10],[56,13,58,13],[25,10,28,10],[29,10,30,10],[38,10,39,10],[40,10,42,10],[23,11,24,11],[25,11,28,11],[29,11,30,11],[40,11,42,11],[38,11,39,11],[23,4,23,8],[12,10,13,10],[15,10,17,10],[18,10,19,10],[23,10,24,10],[19,4,19,7],[31,10,37,10],[31,11,37,11],[2,12,2,13],[18,11,19,11],[7,12,9,12],[12,11,13,11],[15,11,17,11],[42,4,42,7],[59,12,60,12],[52,11,55,11],[56,12,58,12],[45,11,46,11],[50,11,51,11]]}
[{"$f":"IF(ISBLANK('Form 1 Main'!G14),\"\",'Form 1 Main'!G14)&IF(ISBLANK('Form 1 Main'!G14),\"\",\"的財務申報表\")","v":""},null,null,null,null,null,null,null,null,null,null,null,null,{"$f":"IF(ISBLANK(Config!C7),\"\",Config!C7)","v":""}]
[null,"表格 2",null,null,"規定速動資金計算表"]
[null,null,null,null,"申報月份終結時的狀況",null,null,null,null,null,null,{"$f":"IF(ISBLANK('Form 1 Main'!L21),\"\",'Form 1 Main'!L21)","v":""},"[1004]"]
[]
[]
[null,null,null,null,null,null,null,null,"條次",null,null,null,"(HK$'000)"]
{"$rows_left_out":55}
{"sheet":"Form 3","index":5,"n_rows":82,"n_cols":17,"rows_kept":82,"cut":false,"hidden":false,"merged":[[1,10,1,11],[59,3,59,4],[9,12,9,13],[5,3,5,4],[13,12,13,13],[14,12,14,13],[12,12,12,13],[58,12,58,13],[22,12,22,13],[5,5,5,8],[4,3,4,4],[5,10,5,13],[19,12,19,13],[20,12,20,13],[21,12,21,13],[10,12,10,13],[8,12,8,13],[7,12,7,13],[11,12,11,13],[83,4,83,15],[70,4,70,15],[76,5,76,7],[76,8,76,12],[80,5,80,7],[80,8,80,12],[74,3,74,15],[16,12,16,13],[17,12,17,13],[18,12,18,13],[15,12,15,13],[23,12,23,13],[32,12,32,13],[77,3,77,15],[78,3,78,15],[62,13,62,14],[54,12,54,13],[50,12,50,13],[51,12,51,13],[68,3,68,15],[69,3,69,15],[71,3,71,15],[52,12,52,13],[59,12,59,13],[56,12,56,13],[65,3,65,15],[66,3,66,15],[67,3,67,15],[81,3,81,15],[27,12,27,13],[26,12,26,13],[31,12,31,13],[25,12,25,13],[57,12,57,13],[55,12,55,13],[46,12,46,13],[47,12,47,13],[48,12,48,13],[53,12,53,13],[49,12,49,13],[45,12,45,13],[72,3,72,15],[73,3,73,15],[63,3,63,15],[24,12,24,13],[33,12,33,13],[44,12,44,13],[34,12,34,13],[35,12,35,13],[36,12,36,13],[37,12,37,13],[38,12,38,13],[39,12,39,13],[40,12,40,13],[41,12,41,13],[42,12,42,13],[43,12,43,13],[28,12,28,13],[29,12,29,13],[30,12,30,13]]}
[{"$f":"IF(ISBLANK('Form 1 Main'!G14),\"\",'Form 1 Main'!G14)&IF(ISBLANK('Form 1 Main'!G14),\"\",\"的財務申報表\")","v":""},null,null,null,null,null,null,null,null,null,null,null,null,null,null,null,{"$f":"IF(ISBLANK(Config!C7),\"\",Config!C7)","v":""}]
[null,"表格 3",null,null,"信貸融通摘要 申報月份終結時的狀況",null,null,null,null,null,{"$f":"IF(ISBLANK('Form 1 Main'!L21),\"\",'Form 1 Main'!L21)","v":""},null,"[1004]"]
[]
[]
[]
[null,null,null,"財務機構名稱 \n(附註 3)",null,"信貸融通種類及限額 \n(附註 4)",null,null,null,"持牌法團已\n提取或動用\n的金額\n(附註 1)","所提供保證的種類 \n(附註 5)",null,null,null,"所提供保證\n的市值","所提供保證\n的可接受\n折扣值\n(附註 6)"]
{"$rows_left_out":77}
{"sheet":"Form 4 Table 1","index":6,"n_rows":39,"n_cols":17,"rows_kept":39,"cut":false,"hidden":false,"merged":[[3,9,3,10],[9,7,9,9],[9,10,9,12],[9,13,9,15],[8,7,8,15],[39,2,39,15],[36,2,36,15],[37,2,37,15],[38,2,38,15],[9,6,10,6]]}
[{"$f":"IF(ISBLANK('Form 1 Main'!G14),\"\",'Form 1 Main'!G14)&IF(ISBLANK('Form 1 Main'!G14),\"\",\"的財務申報表\")","v":""},null,null,null,null,null,null,null,null,null,null,null,null,null,null,null,{"$f":"IF(ISBLANK(Config!C7),\"\",Config!C7)","v":""}]
[null,"表格 4  保證金客戶分析"]
[]
[null,"表 1    按申報月份終結時的未經調整貸款結餘作出的分析",null,null,null,null,null,null,null,{"$f":"IF(ISBLANK('Form 1 Main'!L21),\"\",'Form 1 Main'!L21)","v":""},null,"[1004]","(附註 1)"]
[]
[]
{"$rows_left_out":34}
{"sheet":"Form 4 Table 2","index":7,"n_rows":46,"n_cols":6,"rows_kept":46,"cut":false,"hidden":false,"merged":[[6,1,6,5],[43,2,44,5],[45,2,45,5],[39,2,39,3]]}
[{"$f":"IF(ISBLANK('Form 1 Main'!G14),\"\",'Form 1 Main'!G14)&IF(ISBLANK('Form 1 Main'!G14),\"\",\"的財務申報表\")","v":""},null,null,null,null,{"$f":"IF(ISBLANK(Config!C7),\"\",Config!C7)","v":""}]
[null,"表格 4","保證金客戶分析"]
[]
[null,"表 2","按申報月份終結時的經調整貸款結餘作出的分析",null,{"$f":"IF(ISBLANK('Form 1 Main'!L21),\"\",'Form 1 Main'!L21)","v":""},"[1004]"]
[]
[]
{"$rows_left_out":41}
{"sheet":"Form 5","index":8,"n_rows":98,"n_cols":7,"rows_kept":98,"cut":false,"hidden":false,"merged":[[1,1,1,3],[96,2,96,6],[97,2,97,6],[67,2,67,3]]}
[{"$f":"IF(ISBLANK('Form 1 Main'!G14),\"\",'Form 1 Main'!G14)&IF(ISBLANK('Form 1 Main'!G14),\"\",\"的財務申報表\")","v":""},null,null,null,null,null,{"$f":"IF(ISBLANK(Config!C7),\"\",Config!C7)","v":""}]
[null,"表格 5  證券抵押品分析"]
[null,null,"    申報月份終結時的狀況",null,{"$f":"IF(ISBLANK('Form 1 Main'!L21),\"\",'Form 1 Main'!L21)","v":""},"[1004]"]
[]
[null,null,null,"股份代號/\nsedol 號碼\n(附註 2)\n","集中折扣系數\n","市值\n(HK$’000)\n(附註 3)\n"]
[null,null,"(A) 須採用 80% 非速動抵押品扣減率的\n股份或權證的名稱"]
{"$rows_left_out":93}
{"sheet":"Form 6","index":9,"n_rows":41,"n_cols":8,"rows_kept":41,"cut":false,"hidden":false,"merged":[[2,10,2,11],[33,2,33,3],[33,4,34,4],[33,5,34,5],[31,7,32,7],[33,7,34,7],[29,5,30,5],[29,4,30,4],[29,6,30,6],[29,7,30,7],[39,3,39,6],[40,3,40,6],[29,2,29,3],[30,2,30,3],[32,2,32,3],[33,6,34,6],[31,2,31,3],[31,4,32,4],[31,6,32,6]]}
[{"$f":"IF(ISBLANK('Form 1 Main'!G14),\"\",'Form 1 Main'!G14)&IF(ISBLANK('Form 1 Main'!G14),\"\",\"的財務申報表\")","v":""},null,null,null,null,null,null,{"$f":"IF(ISBLANK(Config!C7),\"\",Config!C7)","v":""}]
[null,"表格6",null,"滾存結餘現金客戶分析"]
[null,null,null,"申報月份終結時的狀況",null,{"$f":"IF(ISBLANK('Form 1 Main'!L21),\"\",'Form 1 Main'!L21)","v":""},"[1004]"]
[]
[]
[null,null,"在申報日期淨借方結餘最大的首20名滾存結餘現金客戶"]
{"$rows_left_out":36}
{"sheet":"Form 7","index":10,"n_rows":159,"n_cols":12,"rows_kept":159,"cut":false,"hidden":false,"merged":[[24,10,25,10],[135,4,135,10],[57,3,57,4],[71,3,71,4],[111,3,111,4],[130,4,130,10],[67,10,68,10],[108,10,109,10],[86,3,86,4],[108,8,109,8],[108,6,109,6],[1,8,1,9],[24,8,25,8],[24,6,25,6],[67,6,68,6],[67,8,68,8],[9,2,9,4],[16,2,16,4],[24,2,24,4],[144,1,144,2],[71,1,71,2],[111,1,111,2],[57,1,57,2],[86,1,86,2],[95,3,95,4],[95,1,95,2],[158,4,158,10],[153,1,153,2],[124,2,124,4],[128,2,128,4],[131,4,131,10],[132,4,132,10],[133,4,133,10],[134,4,134,10],[144,4,144,5],[153,4,153,5]]}
[{"$f":"IF(ISBLANK('Form 1 Main'!G14),\"\",'Form 1 Main'!G14)&IF(ISBLANK('Form 1 Main'!G14),\"\",\"的財務申報表\")","v":""},null,null,null,null,null,null,null,null,null,null,{"$f":"IF(ISBLANK(Config!C7),\"\",Config!C7)","v":""}]
[null,"表格 7",null,null,"損益表截至申報月份止的期間",null,null,null,{"$f":"IF(ISBLANK('Form 1 Main'!L21),\"\",'Form 1 Main'!L21)","v":""},null,"[1004]"]
[]
[]
[]
[null,null,null,null,null,null,"\n本月",null,"\n上月",null,"自上一財政年度終結時起計，由年度初至今"]
{"$rows_left_out":154}
{"sheet":"Form 8 Table 1","index":11,"n_rows":61,"n_cols":12,"rows_kept":61,"cut":false,"hidden":false,"merged":[[11,3,11,7],[6,8,8,8],[8,2,8,7],[9,3,9,7],[10,3,10,7],[6,2,7,7],[60,9,64,9],[25,4,25,6],[28,4,28,6],[40,3,40,7],[60,3,64,8],[37,6,37,7],[52,3,52,6],[34,6,34,7],[58,3,59,9],[39,3,39,7],[56,3,56,9],[41,3,41,7],[46,3,46,7],[55,3,55,4],[49,3,49,7],[44,4,44,5],[45,3,45,7],[54,3,54,4],[48,3,48,7],[13,3,13,6],[15,3,15,5],[21,3,21,6],[35,6,35,7],[16,3,16,7],[18,2,18,7],[19,3,19,7],[20,3,20,7],[36,6,36,7]]}
[{"$f":"IF(ISBLANK('Form 1 Main'!G14),\"\",'Form 1 Main'!G14)&IF(ISBLANK('Form 1 Main'!G14),\"\",\"的財務申報表\")","v":""},null,null,null,null,null,null,null,null,{"$f":"IF(ISBLANK(Config!C7),\"\",Config!C7)","v":""}]
[null,"表格 8",null,"客戶資產分析"]
[]
[null,"表 1",null,"申報月份終結時的客戶證券的分析",null,null,null,null,{"$f":"IF(ISBLANK('Form 1 Main'!L21),\"\",'Form 1 Main'!L21)","v":""},"[1004]"]
[]
[]
{"$rows_left_out":56}
{"sheet":"Form 8 Table 2","index":12,"n_rows":53,"n_cols":12,"rows_kept":53,"cut":false,"hidden":false,"merged":[[36,11,37,11],[52,2,55,2],[17,11,20,11],[23,11,24,11],[25,11,26,11],[31,11,34,11],[17,8,20,8],[23,8,24,8],[27,8,28,8],[29,8,30,8],[52,3,55,10],[36,9,37,9],[36,10,37,10],[36,2,37,5],[49,3,49,10],[38,8,39,8],[4,8,4,9],[38,9,39,9],[23,10,24,10],[25,10,26,10],[38,10,39,10],[27,9,28,9],[29,9,30,9],[17,9,20,9],[17,10,20,10],[31,9,34,9],[31,10,34,10],[23,9,24,9],[22,2,22,8],[27,3,28,7],[29,3,30,6],[31,8,34,8],[16,3,16,7],[25,3,26,7],[38,2,38,7],[48,3,48,10],[41,3,41,10],[43,3,43,10],[45,3,45,10],[25,9,26,9],[18,3,20,6],[32,3,34,6],[23,3,24,7],[32,2,34,2]]}
[{"$f":"IF(ISBLANK('Form 1 Main'!G14),\"\",'Form 1 Main'!G14)&IF(ISBLANK('Form 1 Main'!G14),\"\",\"的財務申報表\")","v":""},null,null,null,null,null,null,null,null,null,null,{"$f":"IF(ISBLANK(Config!C7),\"\",Config!C7)","v":""}]
[null,"表格 8  客戶資產分析"]
[]
[null,"表 2",null,"申報月份終結時的獨立存放的"]
[null,null,null,"客戶款項的分析",null,null,null,null,{"$f":"IF(ISBLANK('Form 1 Main'!L21),\"\",'Form 1 Main'!L21)","v":""},null,"[1004]"]
[]
{"$rows_left_out":48}
{"sheet":"Form 9","index":13,"n_rows":44,"n_cols":14,"rows_kept":44,"cut":false,"hidden":false,"merged":[[7,2,14,2],[5,10,5,11],[5,2,5,3],[6,2,6,3],[7,6,7,7],[43,3,43,12],[7,10,9,10],[7,11,10,11],[41,3,41,13],[42,3,42,13],[5,12,8,12],[5,4,5,9],[6,4,6,9],[7,8,10,8]]}
[{"$f":"IF(ISBLANK('Form 1 Main'!G14),\"\",'Form 1 Main'!G14)&IF(ISBLANK('Form 1 Main'!G14),\"\",\"的財務申報表\")","v":""},null,null,null,null,null,null,null,null,null,null,null,null,{"$f":"IF(ISBLANK(Config!C7),\"\",Config!C7)","v":""}]
[null,"表格 9",null,"就槓桿式外匯交易獲發牌的持牌法團的外幣持倉量的狀況"]
[null,null,null,"申報月份終結時的狀況",null,null,null,null,{"$f":"IF(ISBLANK('Form 1 Main'!L21),\"\",'Form 1 Main'!L21)","v":""},"[1004]"]
[]
[]
[null,null,"貨幣\n(附註 1)",null,"外幣持倉量(包括所持有的與認可對手方維持的持倉)",null,null,null,null,null,"與認可對手方的持倉",null,"合計外幣\n總持倉量\n(附註 2)"]
{"$rows_left_out":39}
{"sheet":"Form 10 Table 1","index":14,"n_rows":44,"n_cols":11,"rows_kept":44,"cut":false,"hidden":false,"merged":[[1,7,1,8],[31,2,31,9],[32,2,32,9],[6,4,6,9],[44,2,44,3],[35,2,35,9],[36,2,36,9],[43,2,43,9],[38,2,41,9],[33,2,33,9],[34,2,34,9]]}
[{"$f":"IF(ISBLANK('Form 1 Main'!G14),\"\",'Form 1 Main'!G14)&IF(ISBLANK('Form 1 Main'!G14),\"\",\"的財務申報表\")","v":""},null,null,null,null,null,null,null,null,null,{"$f":"IF(ISBLANK(Config!C7),\"\",Config!C7)","v":""}]
[null,"表格 10","衍生工具自營交易持倉報告 (附註 1 及 2)"]
[]
[null,"表 1","申報月份終結時的衍生工具合約名義"]
[null,null,"數額總額按相關風險作出的分析",null,null,{"$f":"IF(ISBLANK('Form 1 Main'!L21),\"\",'Form 1 Main'!L21)","v":""},"[1004]"]
[]
{"$rows_left_out":39}
{"sheet":"Form 10 Table 2","index":15,"n_rows":28,"n_cols":11,"rows_kept":28,"cut":false,"hidden":false,"merged":[[12,3,13,3],[14,3,15,3],[7,3,10,3],[7,8,10,8],[14,7,15,7],[12,5,13,5],[14,4,15,4],[27,3,28,9],[17,7,20,7],[17,3,20,3],[17,8,20,8],[17,9,20,9],[25,3,25,9],[17,5,20,5],[17,6,20,6],[17,4,20,4],[4,6,4,7],[12,7,13,7],[12,8,13,8],[14,8,15,8],[7,6,10,6],[6,4,6,9],[12,4,13,4],[14,5,15,5],[12,6,13,6],[7,4,10,4],[14,6,15,6],[14,9,15,9],[12,9,13,9],[7,7,10,7],[7,5,10,5],[7,9,10,9]]}
[{"$f":"IF(ISBLANK('Form 1 Main'!G14),\"\",'Form 1 Main'!G14)&IF(ISBLANK('Form 1 Main'!G14),\"\",\"的財務申報表\")","v":""},null,null,null,null,null,null,null,null,null,{"$f":"IF(ISBLANK(Config!C7),\"\",Config!C7)","v":""}]
[null,"表格 10",null,"衍生工具自營交易持倉報告"]
[]
[null,"表 2",null,"申報月份終結時的衍生工具合約按市值及"]
[null,null,null,"未實現價值作出的分析",null,null,{"$f":"IF(ISBLANK('Form 1 Main'!L21),\"\",'Form 1 Main'!L21)","v":""},null,"[1004]"]
[]
{"$rows_left_out":23}
{"sheet":"Form 10 Table 3","index":16,"n_rows":20,"n_cols":15,"rows_kept":20,"cut":false,"hidden":false,"merged":[[17,5,17,6],[4,6,4,7],[13,2,14,3],[13,4,14,4],[9,2,10,3],[6,5,6,12],[9,11,10,12],[9,5,10,6],[9,7,10,8],[9,9,10,10],[11,5,11,6],[11,7,11,8],[12,5,12,6],[12,7,12,8],[13,13,14,13],[11,11,11,12],[17,7,17,8],[17,9,17,10],[17,11,17,12],[16,7,16,8],[16,9,16,10],[13,14,14,14],[11,9,11,10],[12,9,12,10],[21,3,21,12],[12,11,12,12],[16,11,16,12],[13,5,14,6],[13,7,14,8],[13,9,14,10],[13,11,14,12],[15,7,15,8],[15,9,15,10],[15,11,15,12],[16,5,16,6],[19,3,20,12],[15,5,15,6]]}
[{"$f":"IF(ISBLANK('Form 1 Main'!G14),\"\",'Form 1 Main'!G14)&IF(ISBLANK('Form 1 Main'!G14),\"\",\"的財務申報表\")","v":""},null,null,null,null,null,null,null,null,null,null,null,null,null,{"$f":"IF(ISBLANK(Config!C7),\"\",Config!C7)","v":""}]
[null,"表格 10",null,"衍生工具自營交易持倉報告"]
[]
[null,"表 3",null,"申報月份終結時的場外衍生工具合約"]
[null,null,null,"按距離到期日的餘下期間作出的分析",null,null,{"$f":"IF(ISBLANK('Form 1 Main'!L21),\"\",'Form 1 Main'!L21)","v":""},null,"[1004]"]
[]
{"$rows_left_out":15}
{"sheet":"Form 10 Table 4","index":17,"n_rows":30,"n_cols":15,"rows_kept":30,"cut":false,"hidden":false,"merged":[[16,4,16,5],[9,4,10,7],[11,6,12,7],[11,4,12,5],[15,4,15,5],[13,6,13,7],[14,6,14,7],[9,8,12,9],[9,10,12,11],[9,12,12,13],[9,2,11,3],[15,6,15,7],[13,4,13,5],[14,4,14,5],[14,10,14,11],[15,8,15,9],[13,10,13,11],[15,10,15,11],[17,4,17,5],[17,6,17,7],[17,8,17,9],[17,10,17,11],[17,12,17,13],[24,3,25,13],[15,12,15,13],[4,7,4,8],[29,3,29,13],[26,3,27,13],[16,6,16,7],[16,8,16,9],[16,10,16,11],[16,12,16,13],[20,3,21,13],[22,3,23,13],[13,12,13,13],[14,12,14,13],[13,8,13,9],[14,8,14,9],[6,4,6,13]]}
[{"$f":"IF(ISBLANK('Form 1 Main'!G14),\"\",'Form 1 Main'!G14)&IF(ISBLANK('Form 1 Main'!G14),\"\",\"的財務申報表\")","v":""},null,null,null,null,null,null,null,null,null,null,null,null,null,{"$f":"IF(ISBLANK(Config!C7),\"\",Config!C7)","v":""}]
[null,"表格 10",null,"衍生工具自營交易持倉報告"]
[]
[null,"表 4",null,"申報月份終結時的場外衍生工具"]
[null,null,null,"合約按信貸質素作出的分析",null,null,null,{"$f":"IF(ISBLANK('Form 1 Main'!L21),\"\",'Form 1 Main'!L21)","v":""},null,"[1004]"]
[]
{"$rows_left_out":25}
{"sheet":"Form 10 Table 5","index":18,"n_rows":19,"n_cols":12,"rows_kept":19,"cut":false,"hidden":false,"merged":[[18,11,21,11],[4,8,4,9],[18,3,21,10],[8,2,8,8],[16,3,16,10],[14,3,14,10],[8,9,8,10],[6,9,6,10],[9,9,9,10],[10,9,10,10],[9,2,9,8],[10,2,10,8],[12,3,12,10]]}
[{"$f":"IF(ISBLANK('Form 1 Main'!G14),\"\",'Form 1 Main'!G14)&IF(ISBLANK('Form 1 Main'!G14),\"\",\"的財務申報表\")","v":""},null,null,null,null,null,null,null,null,null,null,{"$f":"IF(ISBLANK(Config!C7),\"\",Config!C7)","v":""}]
[null,"表格 10",null,"衍生工具自營交易持倉報告"]
[]
[null,"表 5",null,"申報月份終結時已逾期的場外衍生工具"]
[null,null,null,"合約及信貸虧損的分析",null,null,null,null,{"$f":"IF(ISBLANK('Form 1 Main'!L21),\"\",'Form 1 Main'!L21)","v":""},null,"[1004]"]
[]
{"$rows_left_out":14}
{"sheet":"Form 10 Table 6","index":19,"n_rows":32,"n_cols":12,"rows_kept":32,"cut":false,"hidden":false,"merged":[[5,5,5,10],[18,11,19,11],[20,11,24,11],[13,2,13,4],[7,9,9,9],[7,10,9,10],[10,2,10,4],[11,2,11,4],[7,2,9,4],[7,5,9,5],[7,6,9,6],[7,7,9,7],[7,8,9,8],[15,6,16,6],[15,7,16,7],[15,8,16,8],[31,3,32,10],[18,10,19,10],[20,5,24,5],[20,6,24,6],[20,7,24,7],[20,8,24,8],[20,9,24,9],[18,2,19,4],[20,2,24,4],[18,5,19,5],[18,6,19,6],[18,7,19,7],[18,8,19,8],[18,9,19,9],[20,10,24,10],[29,3,29,10],[17,2,17,4],[15,2,16,4],[27,3,27,10],[15,5,16,5],[15,9,16,9],[15,10,16,10]]}
[{"$f":"IF(ISBLANK('Form 1 Main'!G14),\"\",'Form 1 Main'!G14)&IF(ISBLANK('Form 1 Main'!G14),\"\",\"的財務申報表\")","v":""},null,null,null,null,null,null,null,null,null,null,{"$f":"IF(ISBLANK(Config!C7),\"\",Config!C7)","v":""}]
[null,"表格 10","衍生工具自營交易持倉報告"]
[]
[null,"表 6","截至申報月份止的期間與衍生工具有關的交易利潤及虧損",null,null,null,null,null,null,{"$f":"IF(ISBLANK('Form 1 Main'!L21),\"\",'Form 1 Main'!L21)","v":""},"[1004]"]
[]
[null,null,null,null,null,"(HK$'000)"]
{"$rows_left_out":27}
{"sheet":"Form 11","index":20,"n_rows":54,"n_cols":15,"rows_kept":54,"cut":false,"hidden":false,"merged":[[18,10,18,12],[11,2,11,9],[12,2,12,9],[13,2,13,9],[14,2,14,9],[11,10,11,12],[12,10,12,12],[13,10,13,12],[14,10,14,12],[40,2,40,9],[4,9,4,10],[7,10,7,12],[8,2,10,9],[8,10,10,12],[19,10,19,12],[20,10,20,12],[15,2,15,9],[16,2,16,9],[17,2,17,9],[18,2,18,9],[19,2,19,9],[20,2,20,9],[15,10,15,12],[16,10,16,12],[17,10,17,12],[40,10,40,12],[33,10,33,12],[34,10,34,12],[35,10,35,12],[36,10,36,12],[37,10,37,12],[38,10,38,12],[21,2,21,9],[22,2,22,9],[23,2,23,9],[24,2,24,9],[39,10,39,12],[21,10,21,12],[22,10,22,12],[23,10,23,12],[24,10,24,12],[25,10,25,12],[26,10,26,12],[27,10,27,12],[28,10,28,12],[30,2,30,9],[31,2,31,9],[32,2,32,9],[29,10,29,12],[30,10,30,12],[31,10,31,12],[32,10,32,12],[25,2,25,9],[26,2,26,9],[27,2,27,9],[28,2,28,9],[29,2,29,9],[37,2,37,9],[38,2,38,9],[39,2,39,9],[33,2,33,9],[34,2,34,9],[35,2,35,9],[36,2,36,9]]}
[{"$f":"IF(ISBLANK('Form 1 Main'!G14),\"\",'Form 1 Main'!G14)&IF(ISBLANK('Form 1 Main'!G14),\"\",\"的財務申報表\")","v":""},null,null,null,null,null,null,null,null,null,null,null,null,null,{"$f":"IF(ISBLANK(Config!C7),\"\",Config!C7)","v":""}]
[null,"表格 11",null,"就槓桿式外匯交易獲發牌的持牌法團持有與之維持的外幣持倉的\n"]
[null,null,null,"認可對手方的名單 "]
[]
[null,null,null,"申報月份終結時的狀況",null,null,null,null,null,{"$f":"IF(ISBLANK('Form 1 Main'!L21),\"\",'Form 1 Main'!L21)","v":""},null,"[1004]","(附註 1)"]
[]
{"$rows_left_out":49}
{"sheet":"Form 12","index":21,"n_rows":42,"n_cols":13,"rows_kept":42,"cut":false,"hidden":false,"merged":[[1,5,1,12],[29,12,30,12],[31,12,32,12],[15,12,16,12],[17,12,18,12],[21,12,22,12],[27,12,28,12],[23,3,23,10],[13,12,14,12],[19,11,20,11],[41,5,41,12],[9,3,9,8],[19,3,19,10],[37,5,37,12],[38,5,38,12],[11,11,12,11],[25,11,26,11],[27,11,28,11],[29,11,30,11],[13,11,14,11],[39,5,39,12],[40,5,40,12],[31,11,32,11],[15,11,16,11],[17,11,18,11],[21,11,22,11]]}
[{"$f":"IF(ISBLANK('Form 1 Main'!G14),\"\",'Form 1 Main'!G14)&IF(ISBLANK('Form 1 Main'!G14),\"\",\"的財務申報表\")","v":""},null,null,null,null,null,null,null,null,null,null,null,{"$f":"IF(ISBLANK(Config!C7),\"\",Config!C7)","v":""}]
[null,null,"表格 12",null,null,"客戶狀況及所管理資產的合計淨值"]
[null,null,null,null,null,"申報月份終結時的狀況",null,null,null,null,{"$f":"IF(ISBLANK('Form 1 Main'!L21),\"\",'Form 1 Main'!L21)","v":""},"[1004]     (附註 1)"]
[]
[]
[null,null,"A.","客戶狀況"]
{"$rows_left_out":37}
{"sheet":"Config","index":22,"n_rows":147,"n_cols":50,"rows_kept":147,"cut":false,"hidden":true,"merged":[]}
[null,null,null,"Number of Capacity selection",2,null,null,"Margin ShortFall",{"$f":"COUNTA(H2:H109)","v":2},"Bank Code","Bank Name",{"$f":"COUNTA(J2:J515)","v":146},"保證代號","保證種類",{"$f":"COUNTA(N2:N108)","v":27},null,null,"Currency Code","Currency ",27,"Type of Return",{"$f":"COUNTA(U2:U108)","v":2},"Analysis of Sharholders Fund",{"$f":"COUNTA(W2:W108)","v":2},"Credit Facilities Group",{"$f":"COUNTA(Y2:Y108)","v":50},"合資格準則",{"$f":"COUNTA(AA2:AA108)","v":7},null,"Total No. of Array Field:",{"$f":"COUNTA(AD3:AD106)","v":55},null,null,null,"信貸種類","性質",{"$f":"COUNTA(AI2:AI108)","v":19},null,null,null,null,null,"Month",12,"Year",22,"Group Number",{"$f":"COUNTA(AU2:AU108)","v":10},null,"Lang"]
[null,"Protect? (\"Y\" or blank)","y","Declaration Capacity",null,null,null,null,null,1,"ABN AMRO BANK N.V.",null,"1a","無抵押(即無抵押融通)",null,null,null,"ARS","Argentine Peso",null,null,null,null,null,null,null,null,null,null,"Array Field Name","No. of Row","Key Column","Form No.",null,"1a","只向該持牌法團提供的透支",null,null,null,null,null,null,null,null,null,null,null,null,null,"C"]
[null,"Password","ess2000","負責人員","A",null,null,"交易日期","A",2,"中 國 農 業 銀 行",null,"2a","聯繫證明書",null,null,null,"AUD","Australian Dollar",null,"每月","A","Final","A",1,null,"認可財務機構","a",null,"CFS1001",50,"CFS1001",3,null,"1b","與其他實體(可多於一家)共用的透支",null,null,null,null,null,null,"01",null,2009,null,1]
[null,"Form Name","FRR","獲證監會根據《證券及期貨(財政資源)規則》第 58(5)(e) 條核准的高級人員","B",null,null,"交收日期","B",3,"瑞士友邦銀行有限公司",null,"3a","股東／董事提供的擔保",null,null,null,"BRL","Brazil Real",null,"半年期","B","Interim","B",2,null,"就槓桿式外匯交易獲發牌的持牌法團","b",null,"CFS0001",50,"CFS1001",3,null,"2a","只向該持牌法團提供的有期貸款／自動延期貸款",null,null,null,null,null,null,"02",null,2010,null,2]
[null,"Form Version","8",null,null,null,null,null,null,4,"ALLAHABAD BANK",null,"3b","集團公司提供的擔保",null,null,null,"GBP","British Pound",null,null,null,null,null,3,null,"就期貨合約交易獲發牌的法團，而該法團在任何指明期貨交易所進行貨幣期貨合約交易","c",null,"CFS0002",50,"CFS1001",3,null,"2b","與其他實體(可多於一家)共用的有期貸款／自動延期貸款",null,null,null,null,null,null,"03",null,2011,null,3]
[null,"Delimiter","$$$",null,null,null,null,null,null,5,"美 國 運 通 銀 行",null,"3c","其他人士提供的擔保",null,null,null,"CAD","Canadian Dollar",null,null,null,null,null,4,null,"在任何指明期貨交易所進行貨幣期貨合約交易的等同法團","d",null,"CFS1002",50,"CFS1001",3,null,"3a","提取只向該持牌法團提供的未結清支票／單日信貸融通",null,null,null,null,null,null,"04",null,2012,null,4]
{"$rows_left_out":142}
{"sheet":"Error Message","index":23,"n_rows":154,"n_cols":2,"rows_kept":154,"cut":false,"hidden":true,"merged":[]}
["Error Message ID","Error Message"]
[100,"請於表格1選擇\"每月\"或\"半年期\"的財務申報表。"]
[101,"請於表格1填寫\"持牌法團名稱\" - {1}。"]
[102,"請於表格1填寫\"中央編號\" - {1}。"]
[103,"請以\"XXX999\" 的格式 (即3個英文字母 + 3個數字) 填寫中央編號。"]
[104,"請於表格1選擇\"申報月份\" - {1}。"]
{"$rows_left_out":149}
{"sheet":"Label Mapping","index":24,"n_rows":722,"n_cols":3,"rows_kept":722,"cut":false,"hidden":true,"merged":[]}
["Form 1 Table 1"]
["Field ID","Display Label ID","Item no."]
["LCC1001",1000]
["LCC0001",1001,"Item 1"]
["LCC0002",1002,"Item 1"]
["LCC0003",1003,"Item 2"]
{"$rows_left_out":716}